Reaction Details
TargetDelta-type opioid receptor
LigandBDBM50194273
Substrate/Competitorn/a
Meas. Tech.ChEMBL_533285 (CHEMBL973304)
Ki 210±n/a nM
Citation Wentland, MPSun, XCohen, DJBidlack, JM Redefining the structure-activity relationships of 2,6-methano-3-benzazocines. Part 6: Opioid receptor binding properties of cyclic variants of 8-carboxamidocyclazocine. Bioorg Med Chem16:5653-64 (2008) 
 
Delta-type opioid receptor
Name:Delta-type opioid receptor
Type:G Protein-Coupled Receptor (GPCR)
Mol. Mass.:40382.98
Organism:Homo sapiens (Human)
Description:Competition binding assays were carried out using membrane preparations from transfected HN9.10 cells that constitutively expressed the delta opioid receptor.
Residue:372
BDBM50194273
NameBDBM50194273
Synonyms:(+/-)-3-(cyclopropylmethyl)-1,2,3,4,5,6-hexahydro-cis-6,11-dimethyl-N-(phenylmethyl)-2,6-methano-3-benzazocine-8-carboxamide cis-rac-3-Cyclopropylmethyl-6,11-dimethyl-1,2,3,4,5,6-hexahydro-2,6-methano-benzo[d]azocine-8-carboxylic acid benzylamide
TypeSmall organic molecule
Emp. Form.C26H32N2O
Mol. Mass.388.5451
SMILESC[C@H]1C2Cc3ccc(cc3[C@@]1(C)CCN2CC1CC1)C(=O)NCc1ccccc1