Reaction Details
TargetMu-type opioid receptor
LigandBDBM50261630
Substrate/Competitorn/a
Meas. Tech.ChEMBL_533284 (CHEMBL973302)
Ki 6.9±n/a nM
Citation Wentland, MPSun, XCohen, DJBidlack, JM Redefining the structure-activity relationships of 2,6-methano-3-benzazocines. Part 6: Opioid receptor binding properties of cyclic variants of 8-carboxamidocyclazocine. Bioorg Med Chem16:5653-64 (2008) 
 
Mu-type opioid receptor
Name:Mu-type opioid receptor
Type:G Protein-Coupled Receptor (GPCR)
Mol. Mass.:44789.51
Organism:Homo sapiens (Human)
Description:P35372
Residue:400
BDBM50261630
NameBDBM50261630
Synonyms:(1S,17R)-14-(cyclopropylmethyl)-1,17-dimethyl-N-[2-(4-phenylphenyl)ethyl]-4,6,14-triazatetracyclo[11.3.1.0^{2,11}.0^{3,8}]heptadeca-2,4,6,8,10-pentaen-7-amine | CHEMBL468857
TypeSmall organic molecule
Emp. Form.C34H38N4
Mol. Mass.502.6923
SMILESC[C@H]1C2Cc3ccc4c(NCCc5ccc(cc5)-c5ccccc5)ncnc4c3[C@@]1(C)CCN2CC1CC1