Reaction Details
TargetMu-type opioid receptor
LigandBDBM50261629
Substrate/Competitorn/a
Meas. Tech.ChEMBL_533284 (CHEMBL973302)
Ki 890±n/a nM
Citation Wentland, MPSun, XCohen, DJBidlack, JM Redefining the structure-activity relationships of 2,6-methano-3-benzazocines. Part 6: Opioid receptor binding properties of cyclic variants of 8-carboxamidocyclazocine. Bioorg Med Chem16:5653-64 (2008) 
 
Mu-type opioid receptor
Name:Mu-type opioid receptor
Type:G Protein-Coupled Receptor (GPCR)
Mol. Mass.:44789.51
Organism:Homo sapiens (Human)
Description:P35372
Residue:400
BDBM50261629
NameBDBM50261629
Synonyms:(1S,17R)-14-(cyclopropylmethyl)-1,17-dimethyl-6,8,14-triazatetracyclo[11.3.1.0^{2,11}.0^{4,9}]heptadeca-2,4(9),5,7,10-pentaen-5-amine | CHEMBL502583
TypeSmall organic molecule
Emp. Form.C20H26N4
Mol. Mass.322.4472
SMILESC[C@H]1C2Cc3cc4ncnc(N)c4cc3[C@@]1(C)CCN2CC1CC1