Reaction Details
TargetKappa-type opioid receptor
LigandBDBM50261688
Substrate/Competitorn/a
Meas. Tech.ChEMBL_533286 (CHEMBL973305)
Ki 48±n/a nM
Citation Wentland, MPSun, XCohen, DJBidlack, JM Redefining the structure-activity relationships of 2,6-methano-3-benzazocines. Part 6: Opioid receptor binding properties of cyclic variants of 8-carboxamidocyclazocine. Bioorg Med Chem16:5653-64 (2008) 
 
Kappa-type opioid receptor
Name:Kappa-type opioid receptor
Type:G Protein-Coupled Receptor (GPCR)
Mol. Mass.:42648.76
Organism:Homo sapiens (Human)
Description:P41145
Residue:380
BDBM50261688
NameBDBM50261688
Synonyms:(1S,17R)-N-benzyl-14-(cyclopropylmethyl)-1,17-dimethyl-6,8,14-triazatetracyclo[11.3.1.0^{2,11}.0^{4,9}]heptadeca-2,4(9),5,7,10-pentaen-5-amine | CHEMBL468182
TypeSmall organic molecule
Emp. Form.C27H32N4
Mol. Mass.412.5698
SMILESC[C@H]1C2Cc3cc4ncnc(NCc5ccccc5)c4cc3[C@@]1(C)CCN2CC1CC1