Reaction Details
TargetHistamine H4 receptor
LigandBDBM22883
Substrate/Competitorn/a
Meas. Tech.ChEMBL_552365 (CHEMBL1005955)
Ki 90±n/a nM
Citation Kiss, RKiss, BKönczöl, ASzalai, FJelinek, ILászló, VNoszál, BFalus, AKeseru, GM Discovery of novel human histamine H4 receptor ligands by large-scale structure-based virtual screening. J Med Chem51:3145-53 (2008) 
 
Histamine H4 receptor
Name:Histamine H4 receptor
Type:G Protein-Coupled Receptor (GPCR)
Mol. Mass.:44517.02
Organism:Homo sapiens (Human)
Description:Binding assays were using CHO cells stably expressing hH4R receptors.
Residue:390
BDBM22883
NameBDBM22883
Synonyms:CHEMBL12344 [3-(carbamimidoylsulfanyl)propyl]dimethylamine
TypeSmall organic molecule
Emp. Form.C6H15N3S
Mol. Mass.161.268
SMILESCN(C)CCCSC(N)=N