Reaction Details
Target5-hydroxytryptamine receptor 2A
LigandBDBM28582
Substrate/Competitorn/a
Meas. Tech.ChEMBL_556494 (CHEMBL956489)
Ki 28±n/a nM
Citation Nichols, DEFrescas, SPChemel, BRRehder, KSZhong, DLewin, AH High specific activity tritium-labeled N-(2-methoxybenzyl)-2,5-dimethoxy-4-iodophenethylamine (INBMeO): a high-affinity 5-HT2A receptor-selective agonist radioligand. Bioorg Med Chem16:6116-23 (2008) 
 
5-hydroxytryptamine receptor 2A
Name:5-hydroxytryptamine receptor 2A
Type:undefined
Mol. Mass.:52607.65
Organism:Homo sapiens (Human)
Description:P28223
Residue:471
BDBM28582
NameBDBM28582
Synonyms:1-(4-iodo-2,5-dimethoxyphenyl)propan-2-amine DOI DOI,(-) [125I]4-iodo-2,5-dimethoxyphenylisopropylamine | [125I]DOI
Typeradiolabeled ligand
Emp. Form.C11H16INO2
Mol. Mass.321.1547
SMILESCOc1cc(CC(C)N)c(OC)cc1I