Reaction Details
TargetTranslocator protein
LigandBDBM50271820
Substrate/Competitorn/a
Meas. Tech.ChEMBL_556776 (CHEMBL961474)
IC50 0.28±n/a nM
Citation Yu, WWang, EVoll, RJMiller, AHGoodman, MM Synthesis, fluorine-18 radiolabeling, and in vitro characterization of 1-iodophenyl-N-methyl-N-fluoroalkyl-3-isoquinoline carboxamide derivatives as potential PET radioligands for imaging peripheral benzodiazepine receptor. Bioorg Med Chem16:6145-55 (2008) 
 
Translocator protein
Name:Translocator protein
Type:Mitochondrion membrane protein
Mol. Mass.:18945.84
Organism:Rattus norvegicus (rat)
Description:Competitive binding experiments were performed on rat kidney mitochondrial membranes.
Residue:169
BDBM50271820
NameBDBM50271820
Synonyms:1-(2-iodophenyl)-N-methyl-N-(3-fluoropropyl)-3-isoquinoline carboxamide | CHEMBL483129
TypeSmall organic molecule
Emp. Form.C20H18FIN2O
Mol. Mass.448.2726
SMILESCN(CCCF)C(=O)c1cc2ccccc2c(n1)-c1ccccc1I