Reaction Details
TargetSolute carrier family 22 member 6
LigandBDBM50270011
Substrate/Competitorn/a
Meas. Tech.ChEMBL_508179 (CHEMBL1008237)
Ki 220000±n/a nM
Citation Kaler, GTruong, DMKhandelwal, ANagle, MEraly, SASwaan, PWNigam, SK Structural variation governs substrate specificity for organic anion transporter (OAT) homologs. Potential remote sensing by OAT family members. J Biol Chem282:23841-53 (2007) 
 
Solute carrier family 22 member 6
Name:Solute carrier family 22 member 6
Type:PROTEIN
Mol. Mass.:60032.49
Organism:Mus musculus
Description:ChEMBL_508179
Residue:545
BDBM50270011
NameBDBM50270011
Synonyms:estradiol disulfate
TypeSmall organic molecule
Emp. Form.C18H22O8S2
Mol. Mass.430.494
SMILESC[C@]12CC[C@H]3[C@@H](CCc4cc(OS([O-])(=O)=O)ccc34)[C@@H]1CC[C@@H]2OS([O-])(=O)=O