Reaction Details
TargetSolute carrier family 22 member 6
LigandBDBM26193
Substrate/Competitorn/a
Meas. Tech.ChEMBL_508179 (CHEMBL1008237)
Ki 145000±n/a nM
Citation Kaler, GTruong, DMKhandelwal, ANagle, MEraly, SASwaan, PWNigam, SK Structural variation governs substrate specificity for organic anion transporter (OAT) homologs. Potential remote sensing by OAT family members. J Biol Chem282:23841-53 (2007) 
 
Solute carrier family 22 member 6
Name:Solute carrier family 22 member 6
Type:PROTEIN
Mol. Mass.:60032.49
Organism:Mus musculus
Description:ChEMBL_508179
Residue:545
BDBM26193
NameBDBM26193
Synonyms:2-Hydroxybenzoate, I CHEMBL424 salicylic acid
TypeSmall organic molecule
Emp. Form.C7H6O3
Mol. Mass.138.1207
SMILESOC(=O)c1ccccc1O