Reaction Details
TargetSolute carrier family 22 member 6
LigandBDBM36181
Substrate/Competitorn/a
Meas. Tech.ChEMBL_508179 (CHEMBL1008237)
Ki 253000±n/a nM
Citation Kaler, GTruong, DMKhandelwal, ANagle, MEraly, SASwaan, PWNigam, SK Structural variation governs substrate specificity for organic anion transporter (OAT) homologs. Potential remote sensing by OAT family members. J Biol Chem282:23841-53 (2007) 
 
Solute carrier family 22 member 6
Name:Solute carrier family 22 member 6
Type:PROTEIN
Mol. Mass.:60032.49
Organism:Mus musculus
Description:ChEMBL_508179
Residue:545
BDBM36181
NameBDBM36181
Synonyms:SODIUM BENZOATE benzoic acid | benzoic acid-d5
TypeGuest
Emp. Form.C7H5O2
Mol. Mass.121.1139
SMILES[O-]C(=O)c1ccccc1