Reaction Details
TargetSolute carrier family 22 member 20
LigandBDBM50269962
Substrate/Competitorn/a
Meas. Tech.ChEMBL_508178 (CHEMBL1008236)
Ki 32300±n/a nM
Citation Kaler, GTruong, DMKhandelwal, ANagle, MEraly, SASwaan, PWNigam, SK Structural variation governs substrate specificity for organic anion transporter (OAT) homologs. Potential remote sensing by OAT family members. J Biol Chem282:23841-53 (2007) 
 
Solute carrier family 22 member 20
Name:Solute carrier family 22 member 20
Type:PROTEIN
Mol. Mass.:60953.19
Organism:Mus musculus
Description:ChEMBL_508178
Residue:556
BDBM50269962
NameBDBM50269962
Synonyms:3-methyl-n-butyrate 3-methylbutyrate beta-methylbutyrate isopentanoate isovalerate | isovalerianate
TypeSmall organic molecule
Emp. Form.C5H9O2
Mol. Mass.101.1243
SMILESCC(C)CC([O-])=O