Reaction Details
TargetDipeptidyl peptidase 4
LigandBDBM50242478
Substrate/Competitorn/a
Meas. Tech.ChEMBL_534536 (CHEMBL985439)
IC50 8.6±n/a nM
Citation Fukushima, HHiratate, ATakahashi, MMikami, ASaito-Hori, MMunetomo, EKitano, KChonan, SSaito, HSuzuki, ATakaoka, YYamamoto, K Synthesis and structure-activity relationships of potent 4-fluoro-2-cyanopyrrolidine dipeptidyl peptidase IV inhibitors. Bioorg Med Chem16:4093-106 (2008) 
 
Dipeptidyl peptidase 4
Name:Dipeptidyl peptidase 4
Type:Enzyme
Mol. Mass.:88271.01
Organism:Homo sapiens (Human)
Description:P27487
Residue:766
BDBM50242478
NameBDBM50242478
Synonyms:(2S,4S)-4-Fluoro-1-{N-[1-(2-furyl)-1-methylethyl]-glycyl}pyrrolidine-2-carbonitrile | CHEMBL471089
TypeSmall organic molecule
Emp. Form.C14H18FN3O2
Mol. Mass.279.31
SMILESCC(C)(NCC(=O)N1C[C@@H](F)C[C@H]1C#N)c1ccco1