Reaction Details
TargetDipeptidyl peptidase 4
LigandBDBM50242610
Substrate/Competitorn/a
Meas. Tech.ChEMBL_534536 (CHEMBL985439)
IC50 31±n/a nM
Citation Fukushima, HHiratate, ATakahashi, MMikami, ASaito-Hori, MMunetomo, EKitano, KChonan, SSaito, HSuzuki, ATakaoka, YYamamoto, K Synthesis and structure-activity relationships of potent 4-fluoro-2-cyanopyrrolidine dipeptidyl peptidase IV inhibitors. Bioorg Med Chem16:4093-106 (2008) 
 
Dipeptidyl peptidase 4
Name:Dipeptidyl peptidase 4
Type:Enzyme
Mol. Mass.:88271.01
Organism:Homo sapiens (Human)
Description:P27487
Residue:766
BDBM50242610
NameBDBM50242610
Synonyms:CHEMBL520854 | N-[2-({2-[(2S,4S)-2-Cyano-4-fluoropyrrolidin-1-yl]-2-oxoethyl}amino)-2-methylpropyl]-N-methylbenzenesulfonamide
TypeSmall organic molecule
Emp. Form.C18H25FN4O3S
Mol. Mass.396.48
SMILESCN(CC(C)(C)NCC(=O)N1C[C@@H](F)C[C@H]1C#N)S(=O)(=O)c1ccccc1