Reaction Details
TargetDipeptidyl peptidase 4
LigandBDBM50242608
Substrate/Competitorn/a
Meas. Tech.ChEMBL_534536 (CHEMBL985439)
IC50 109±n/a nM
Citation Fukushima, HHiratate, ATakahashi, MMikami, ASaito-Hori, MMunetomo, EKitano, KChonan, SSaito, HSuzuki, ATakaoka, YYamamoto, K Synthesis and structure-activity relationships of potent 4-fluoro-2-cyanopyrrolidine dipeptidyl peptidase IV inhibitors. Bioorg Med Chem16:4093-106 (2008) 
 
Dipeptidyl peptidase 4
Name:Dipeptidyl peptidase 4
Type:Enzyme
Mol. Mass.:88271.01
Organism:Homo sapiens (Human)
Description:P27487
Residue:766
BDBM50242608
NameBDBM50242608
Synonyms:2,2-Bis(4-chlorophenyl)-N-[2-({2-[(2S,4S)-2-cyano-4-fluoropyrrolidin-1-yl]-2-oxoethyl}amino)-2-methylpropyl]acetamide | CHEMBL488810
TypeSmall organic molecule
Emp. Form.C25H27Cl2FN4O2
Mol. Mass.505.412
SMILESCC(C)(CNC(=O)C(c1ccc(Cl)cc1)c1ccc(Cl)cc1)NCC(=O)N1C[C@@H](F)C[C@H]1C#N