Reaction Details
TargetAdenosine receptor A3
LigandBDBM50377934
Substrate/Competitorn/a
Meas. Tech.ChEMBL_529843 (CHEMBL967546)
Ki>100000±n/a nM
Citation Ishiyama, HOhshita, KAbe, TNakata, HKobayashi, J Synthesis of eudistomin D analogues and its effects on adenosine receptors. Bioorg Med Chem16:3825-30 (2008) 
 
Adenosine receptor A3
Name:Adenosine receptor A3
Type:G Protein-Coupled Receptor (GPCR)
Mol. Mass.:36197.32
Organism:Homo sapiens (Human)
Description:P0DMS8
Residue:318
BDBM50377934
NameBDBM50377934
Synonyms:CHEMBL540656
TypeSmall organic molecule
Emp. Form.C15H17N2O
Mol. Mass.241.3077
SMILESCc1cc2n(C)c3c[n+](C)ccc3c2c(C)c1O