Reaction Details
TargetAdenosine receptor A1
LigandBDBM50251139
Substrate/Competitorn/a
Meas. Tech.ChEMBL_529841 (CHEMBL967544)
Ki>100000±n/a nM
Citation Ishiyama, HOhshita, KAbe, TNakata, HKobayashi, J Synthesis of eudistomin D analogues and its effects on adenosine receptors. Bioorg Med Chem16:3825-30 (2008) 
 
Adenosine receptor A1
Name:Adenosine receptor A1
Type:G Protein-Coupled Receptor (GPCR)
Mol. Mass.:36520.92
Organism:Homo sapiens (Human)
Description:P30542
Residue:326
BDBM50251139
NameBDBM50251139
Synonyms:6-Hydroxy-5,7,9-trimethyl-beta-carboline | CHEMBL458409
TypeSmall organic molecule
Emp. Form.C14H14N2O
Mol. Mass.226.2738
SMILESCc1cc2n(C)c3cnccc3c2c(C)c1O