Reaction Details
TargetAdenosine receptor A2a
LigandBDBM50251147
Substrate/Competitorn/a
Meas. Tech.ChEMBL_529842 (CHEMBL967545)
Ki 44100±n/a nM
Citation Ishiyama, HOhshita, KAbe, TNakata, HKobayashi, J Synthesis of eudistomin D analogues and its effects on adenosine receptors. Bioorg Med Chem16:3825-30 (2008) 
 
Adenosine receptor A2a
Name:Adenosine receptor A2a
Type:G Protein-Coupled Receptor (GPCR)
Mol. Mass.:44716.46
Organism:Homo sapiens (Human)
Description:P29274
Residue:412
BDBM50251147
NameBDBM50251147
Synonyms:8-Hydroxy-5,7,9-trimethyl-delta-carboline | CHEMBL458947
TypeSmall organic molecule
Emp. Form.C14H14N2O
Mol. Mass.226.2738
SMILESCc1cc2n(C)c3cccnc3c2c(C)c1O