Reaction Details
TargetAdenosine receptor A3
LigandBDBM50377935
Substrate/Competitorn/a
Meas. Tech.ChEMBL_529843 (CHEMBL967546)
Ki 29700±n/a nM
Citation Ishiyama, HOhshita, KAbe, TNakata, HKobayashi, J Synthesis of eudistomin D analogues and its effects on adenosine receptors. Bioorg Med Chem16:3825-30 (2008) 
 
Adenosine receptor A3
Name:Adenosine receptor A3
Type:G Protein-Coupled Receptor (GPCR)
Mol. Mass.:36197.32
Organism:Homo sapiens (Human)
Description:P0DMS8
Residue:318
BDBM50377935
NameBDBM50377935
Synonyms:CHEMBL541164
TypeSmall organic molecule
Emp. Form.C14H15N2O
Mol. Mass.227.2812
SMILESCc1cc2[nH]c3c[n+](C)ccc3c2c(C)c1O