Reaction Details
TargetAdenosine receptor A1
LigandBDBM50118810
Substrate/Competitorn/a
Meas. Tech.ChEMBL_528526 (CHEMBL972061)
EC50 1200±n/a nM
Citation Gafner, SDietz, BMMcPhail, KLScott, IMGlinski, JARussell, FEMcCollom, MMBudzinski, JWFoster, BCBergeron, CRhyu, MRBolton, JL Alkaloids from Eschscholzia californica and their capacity to inhibit binding of [3H]8-Hydroxy-2-(di-N-propylamino)tetralin to 5-HT1A receptors in Vitro. J Nat Prod69:432-5 (2006) 
 
Adenosine receptor A1
Name:Adenosine receptor A1
Type:G Protein-Coupled Receptor (GPCR)
Mol. Mass.:36520.92
Organism:Homo sapiens (Human)
Description:P30542
Residue:326
BDBM50118810
NameBDBM50118810
Synonyms:(2R,3S,4R,5R)-2-(hydroxymethyl)-5-(6-((R)-1-phenylpropan-2-ylamino)-9H-purin-9-yl)-tetrahydrofuran-3,4-diol CHEMBL139000 R-N6-(phenylisopropyl)adenosine
TypeSmall organic molecule
Emp. Form.C19H23N5O4
Mol. Mass.385.417
SMILESC[C@H](Cc1ccccc1)Nc1ncnc2n(cnc12)[C@@H]1O[C@H](CO)[C@@H](O)[C@H]1O