Reaction Details
TargetSubstance-K receptor
LigandBDBM50259674
Substrate/Competitorn/a
Meas. Tech.ChEMBL_528445 (CHEMBL977830)
EC50 78.1±n/a nM
Citation Gafner, SDietz, BMMcPhail, KLScott, IMGlinski, JARussell, FEMcCollom, MMBudzinski, JWFoster, BCBergeron, CRhyu, MRBolton, JL Alkaloids from Eschscholzia californica and their capacity to inhibit binding of [3H]8-Hydroxy-2-(di-N-propylamino)tetralin to 5-HT1A receptors in Vitro. J Nat Prod69:432-5 (2006) 
 
Substance-K receptor
Name:Substance-K receptor
Type:Protein
Mol. Mass.:44455.78
Organism:Homo sapiens (Human)
Description:P21452
Residue:398
BDBM50259674
NameBDBM50259674
Synonyms:(S)-3-amino-4-((S)-1-((R)-1-((S)-1-((R)-1-((R)-1-((S)-1,6-diamino-1-oxohexan-2-ylamino)-3-(1H-indol-3-yl)-1-oxopropan-2-ylamino)-3-(1H-indol-3-yl)-1-oxopropan-2-ylamino)-3-methyl-1-oxobutan-2-ylamino)-3-(1H-indol-3-yl)-1-oxopropan-2-ylamino)-3-(4-hydroxyphenyl)-1-oxopropan-2-ylamino)-4-oxobutanoic acid | CHEMBL507824
TypeSmall organic molecule
Emp. Form.C57H68N12O10
Mol. Mass.1081.2242
SMILESCC(C)[C@H](NC(=O)[C@@H](Cc1c[nH]c2ccccc12)NC(=O)[C@H](Cc1ccc(O)cc1)NC(=O)[C@@H](N)CC(O)=O)C(=O)N[C@H](Cc1c[nH]c2ccccc12)C(=O)N[C@H](Cc1c[nH]c2ccccc12)C(=O)N[C@@H](CCCCN)C(N)=O