Reaction Details
TargetTyrosine-protein phosphatase non-receptor type 1
LigandBDBM50241807
Substrate/Competitorn/a
Meas. Tech.ChEMBL_527248 (CHEMBL972808)
IC50 14800±n/a nM
Citation Na, MJang, JNjamen, DMbafor, JTFomum, ZTKim, BYOh, WKAhn, JS Protein tyrosine phosphatase-1B inhibitory activity of isoprenylated flavonoids isolated from Erythrina mildbraedii. J Nat Prod69:1572-6 (2006) 
 
Tyrosine-protein phosphatase non-receptor type 1
Name:Tyrosine-protein phosphatase non-receptor type 1
Type:Protein phosphatase
Mol. Mass.:49963.76
Organism:Homo sapiens (Human)
Description:Human recombinant GST-fusion PTP1B (1-435).
Residue:435
BDBM50241807
NameBDBM50241807
Synonyms:CHEMBL470865 | abyssinone-VI-4-O-methyl ether
TypeSmall organic molecule
Emp. Form.C26H30O4
Mol. Mass.406.514
SMILES[#6]-[#8]-c1c(-[#6]\[#6]=[#6](\[#6])-[#6])cc(\[#6]=[#6]\[#6](=O)-c2ccc(-[#8])cc2-[#8])cc1-[#6]\[#6]=[#6](\[#6])-[#6]