Reaction Details
TargetTyrosine-protein phosphatase non-receptor type 1
LigandBDBM50042944
Substrate/Competitorn/a
Meas. Tech.ChEMBL_527248 (CHEMBL972808)
IC50>60000±n/a nM
Citation Na, MJang, JNjamen, DMbafor, JTFomum, ZTKim, BYOh, WKAhn, JS Protein tyrosine phosphatase-1B inhibitory activity of isoprenylated flavonoids isolated from Erythrina mildbraedii. J Nat Prod69:1572-6 (2006) 
 
Tyrosine-protein phosphatase non-receptor type 1
Name:Tyrosine-protein phosphatase non-receptor type 1
Type:Protein phosphatase
Mol. Mass.:49963.76
Organism:Homo sapiens (Human)
Description:Human recombinant GST-fusion PTP1B (1-435).
Residue:435
BDBM50042944
NameBDBM50042944
Synonyms:(E)-1-(2,4-Dihydroxy-phenyl)-3-(4-hydroxy-phenyl)-propenone 1-(2,4-Dihydroxy-phenyl)-3-(4-hydroxy-phenyl)-propenone 1-(2,4-dihydroxyphenyl)-3-(4-hydroxyphenyl)prop-2-en-1-one 2',4,4'-trihydroxychalcone CHEMBL129795 cid_638278
TypeSmall organic molecule
Emp. Form.C15H12O4
Mol. Mass.256.2534
SMILESOc1ccc(\C=C\C(=O)c2ccc(O)cc2O)cc1