Reaction Details
TargetCytochrome P450 3A4
LigandBDBM50241524
Substrate/Competitorn/a
Meas. Tech.ChEMBL_526157 (CHEMBL970953)
IC50 1000±n/a nM
Citation Usia, TWatabe, TKadota, STezuka, Y Potent CYP3A4 inhibitory constituents of Piper cubeba. J Nat Prod68:64-8 (2005) 
 
Cytochrome P450 3A4
Name:Cytochrome P450 3A4
Type:Enzyme
Mol. Mass.:57349.57
Organism:Homo sapiens (Human)
Description:n/a
Residue:503
BDBM50241524
NameBDBM50241524
Synonyms:(-)-deoxypodorhizone CHEMBL471067
TypeSmall organic molecule
Emp. Form.C22H24O7
Mol. Mass.400.4218
SMILESCOc1cc(C[C@@H]2[C@@H](Cc3ccc4OCOc4c3)COC2=O)cc(OC)c1OC