Reaction Details
TargetCytochrome P450 2D6
LigandBDBM50241524
Substrate/Competitorn/a
Meas. Tech.ChEMBL_526158 (CHEMBL970954)
IC50 95700±n/a nM
Citation Usia, TWatabe, TKadota, STezuka, Y Potent CYP3A4 inhibitory constituents of Piper cubeba. J Nat Prod68:64-8 (2005) 
 
Cytochrome P450 2D6
Name:Cytochrome P450 2D6
Type:Protein
Mol. Mass.:55774.82
Organism:Homo sapiens (Human)
Description:P10635
Residue:497
BDBM50241524
NameBDBM50241524
Synonyms:(-)-deoxypodorhizone CHEMBL471067
TypeSmall organic molecule
Emp. Form.C22H24O7
Mol. Mass.400.4218
SMILESCOc1cc(C[C@@H]2[C@@H](Cc3ccc4OCOc4c3)COC2=O)cc(OC)c1OC