Reaction Details
TargetCannabinoid receptor 1
LigandBDBM50263114
Substrate/Competitorn/a
Meas. Tech.ChEMBL_490516 (CHEMBL981122)
Ki 560±n/a nM
Citation Urbani, PCascio, MGRamunno, ABisogno, TSaturnino, CDi Marzo, V Novel sterically hindered cannabinoid CB1 receptor ligands. Bioorg Med Chem16:7510-5 (2008) 
 
Cannabinoid receptor 1
Name:Cannabinoid receptor 1
Type:G Protein-Coupled Receptor (GPCR)
Mol. Mass.:52868.96
Organism:Homo sapiens (Human)
Description:P21554
Residue:472
BDBM50263114
NameBDBM50263114
Synonyms:2-(4-Methylphenyl)-2-phenyl-N-(3,3-diphenylpropyl)-acetamide | CHEMBL476576
TypeSmall organic molecule
Emp. Form.C30H29NO
Mol. Mass.419.5574
SMILESCc1ccc(cc1)C(C(=O)NCCC(c1ccccc1)c1ccccc1)c1ccccc1