Reaction Details
TargetCannabinoid receptor 2
LigandBDBM50263153
Substrate/Competitorn/a
Meas. Tech.ChEMBL_490517 (CHEMBL981123)
Ki 1800±n/a nM
Citation Urbani, PCascio, MGRamunno, ABisogno, TSaturnino, CDi Marzo, V Novel sterically hindered cannabinoid CB1 receptor ligands. Bioorg Med Chem16:7510-5 (2008) 
 
Cannabinoid receptor 2
Name:Cannabinoid receptor 2
Type:G Protein-Coupled Receptor (GPCR)
Mol. Mass.:39690.94
Organism:Homo sapiens (Human)
Description:P34972
Residue:360
BDBM50263153
NameBDBM50263153
Synonyms:CHEMBL478643 | N-(3-Phenyl)propyl-2-(4-bromophenylacetamide)
TypeSmall organic molecule
Emp. Form.C23H22BrNO
Mol. Mass.408.331
SMILESBrc1ccc(cc1)C(C(=O)NCCCc1ccccc1)c1ccccc1