Reaction Details
TargetCannabinoid receptor 2
LigandBDBM50263151
Substrate/Competitorn/a
Meas. Tech.ChEMBL_490517 (CHEMBL981123)
Ki>7900±n/a nM
Citation Urbani, PCascio, MGRamunno, ABisogno, TSaturnino, CDi Marzo, V Novel sterically hindered cannabinoid CB1 receptor ligands. Bioorg Med Chem16:7510-5 (2008) 
 
Cannabinoid receptor 2
Name:Cannabinoid receptor 2
Type:G Protein-Coupled Receptor (GPCR)
Mol. Mass.:39690.94
Organism:Homo sapiens (Human)
Description:P34972
Residue:360
BDBM50263151
NameBDBM50263151
Synonyms:CHEMBL476336 | N-(3-Phenyl)propyl-2,2-diphenylacetamide
TypeSmall organic molecule
Emp. Form.C23H23NO
Mol. Mass.329.4348
SMILESO=C(NCCCc1ccccc1)C(c1ccccc1)c1ccccc1