Reaction Details
TargetCannabinoid receptor 2
LigandBDBM50263074
Substrate/Competitorn/a
Meas. Tech.ChEMBL_490517 (CHEMBL981123)
Ki>7900±n/a nM
Citation Urbani, PCascio, MGRamunno, ABisogno, TSaturnino, CDi Marzo, V Novel sterically hindered cannabinoid CB1 receptor ligands. Bioorg Med Chem16:7510-5 (2008) 
 
Cannabinoid receptor 2
Name:Cannabinoid receptor 2
Type:G Protein-Coupled Receptor (GPCR)
Mol. Mass.:39690.94
Organism:Homo sapiens (Human)
Description:P34972
Residue:360
BDBM50263074
NameBDBM50263074
Synonyms:2-(4-Bromophenyl)-2-phenyl-N-(3,3-diphenylpropyl)-acetamide | CHEMBL475910
TypeSmall organic molecule
Emp. Form.C29H26BrNO
Mol. Mass.484.427
SMILESBrc1ccc(cc1)C(C(=O)NCCC(c1ccccc1)c1ccccc1)c1ccccc1