Reaction Details
TargetNeuronal acetylcholine receptor subunit alpha-3
LigandBDBM50263094
Substrate/Competitorn/a
Meas. Tech.ChEMBL_489291 (CHEMBL990847)
Ki 3680±n/a nM
Citation Gao, YKuwabara, HSpivak, CEXiao, YKellar, KRavert, HTKumar, AAlexander, MHilton, JWong, DFDannals, RFHorti, AG Discovery of (-)-7-methyl-2-exo-[3'-(6-[18F]fluoropyridin-2-yl)-5'-pyridinyl]-7-azabicyclo[2.2.1]heptane, a radiolabeled antagonist for cerebral nicotinic acetylcholine receptor (alpha4beta2-nAChR) with optimal positron emission tomography imaging properties. J Med Chem51:4751-64 (2008) 
 
Neuronal acetylcholine receptor subunit alpha-3
Name:Neuronal acetylcholine receptor subunit alpha-3
Type:Enzyme
Mol. Mass.:56995.52
Organism:Rattus norvegicus (Rat)
Description:P04757
Residue:499
BDBM50263094
NameBDBM50263094
Synonyms:(S)-3-(azetidin-2-ylmethoxy)-2-[18F]fluoropyridine | CHEMBL449437
TypeSmall organic molecule
Emp. Form.C9H11FN2O
Mol. Mass.182.1948
SMILESFc1ncccc1OC[C@@H]1CCN1