Reaction Details
TargetNeuronal acetylcholine receptor subunit alpha-4
LigandBDBM50263095
Substrate/Competitorn/a
Meas. Tech.ChEMBL_489287 (CHEMBL990843)
Ki 0.019±n/a nM
Citation Gao, YKuwabara, HSpivak, CEXiao, YKellar, KRavert, HTKumar, AAlexander, MHilton, JWong, DFDannals, RFHorti, AG Discovery of (-)-7-methyl-2-exo-[3'-(6-[18F]fluoropyridin-2-yl)-5'-pyridinyl]-7-azabicyclo[2.2.1]heptane, a radiolabeled antagonist for cerebral nicotinic acetylcholine receptor (alpha4beta2-nAChR) with optimal positron emission tomography imaging properties. J Med Chem51:4751-64 (2008) 
 
Neuronal acetylcholine receptor subunit alpha-4
Name:Neuronal acetylcholine receptor subunit alpha-4
Type:Enzyme
Mol. Mass.:70196.44
Organism:Rattus norvegicus (Rat)
Description:P09483
Residue:630
BDBM50263095
NameBDBM50263095
Synonyms:(+)-7-Methyl-2-exo-[3'-(2-fluoropyridin-4-yl)-5'-pyridinyl]-7-azabicyclo[2.2.1]heptane (-)-7-Methyl-2-exo-[3'-(2-fluoropyridin-4-yl)-5'-pyridinyl]-7-azabicyclo[2.2.1]heptane | CHEMBL514372
TypeSmall organic molecule
Emp. Form.C17H18FN3
Mol. Mass.283.3433
SMILESCN1[C@@H]2CC[C@@H]1[C@H](C2)c1cncc(c1)-c1ccnc(F)c1