Reaction Details
TargetNeuronal acetylcholine receptor subunit alpha-6
LigandBDBM50263131
Substrate/Competitorn/a
Meas. Tech.ChEMBL_489293 (CHEMBL990849)
Ki 0.95±n/a nM
Citation Gao, YKuwabara, HSpivak, CEXiao, YKellar, KRavert, HTKumar, AAlexander, MHilton, JWong, DFDannals, RFHorti, AG Discovery of (-)-7-methyl-2-exo-[3'-(6-[18F]fluoropyridin-2-yl)-5'-pyridinyl]-7-azabicyclo[2.2.1]heptane, a radiolabeled antagonist for cerebral nicotinic acetylcholine receptor (alpha4beta2-nAChR) with optimal positron emission tomography imaging properties. J Med Chem51:4751-64 (2008) 
 
Neuronal acetylcholine receptor subunit alpha-6
Name:Neuronal acetylcholine receptor subunit alpha-6
Type:PROTEIN
Mol. Mass.:56943.53
Organism:Rattus norvegicus
Description:ChEMBL_1454451
Residue:493
BDBM50263131
NameBDBM50263131
Synonyms:(+)-7-Methyl-2-exo-[3'-(6-fluoropyridin-2-yl)-5'-pyridinyl]-7-azabicyclo[2.2.1]heptane CHEMBL478447
TypeSmall organic molecule
Emp. Form.C17H18FN3
Mol. Mass.283.3433
SMILESCN1[C@@H]2CC[C@@H]1[C@H](C2)c1cncc(c1)-c1cccc(F)n1