Reaction Details
TargetNociceptin receptor
LigandBDBM50106479
Substrate/Competitorn/a
Meas. Tech.ChEMBL_490896 (CHEMBL989172)
Ki 0.35±n/a nM
Citation Charoenchai, LWang, HWang, JBAldrich, JV High affinity conformationally constrained nociceptin/orphanin FQ(1-13) amide analogues. J Med Chem51:4385-7 (2008) 
 
Nociceptin receptor
Name:Nociceptin receptor
Type:G Protein-Coupled Receptor (GPCR)
Mol. Mass.:40702.87
Organism:Homo sapiens (Human)
Description:P41146
Residue:370
BDBM50106479
NameBDBM50106479
Synonyms:CHEMBL384755 H-FGGFTGARKSARK-NH2 NC(1-13)NH2 OFQ/N | Phe-Gly-Gly-Phe-Thr-Gly-Ala-Arg-Lys-Ser-Ala-Arg-Lys-NH2
TypeSmall organic molecule
Emp. Form.C61H100N22O15
Mol. Mass.1381.5851
SMILES[#6]-[#6@@H](-[#8])-[#6@H](-[#7]-[#6](=O)-[#6@H](-[#6]-c1ccccc1)-[#7]-[#6](=O)-[#6]-[#7]-[#6](=O)-[#6]-[#7]-[#6](=O)-[#6@@H](-[#7])-[#6]-c1ccccc1)-[#6](=O)-[#7]-[#6]-[#6](=O)-[#7]-[#6@@H](-[#6])-[#6](=O)-[#7]-[#6@@H](-[#6]-[#6]-[#6]\[#7]=[#6](/[#7])-[#7])-[#6](=O)-[#7]-[#6@@H](-[#6]-[#6]-[#6]-[#6]-[#7])-[#6](=O)-[#7]-[#6@@H](-[#6]-[#8])-[#6](=O)-[#7]-[#6@@H](-[#6])-[#6](=O)-[#7]-[#6@@H](-[#6]-[#6]-[#6]\[#7]=[#6](/[#7])-[#7])-[#6](=O)-[#7]-[#6@@H](-[#6]-[#6]-[#6]-[#6]-[#7])-[#6](-[#7])=O