Reaction Details
TargetNociceptin receptor
LigandBDBM50262292
Substrate/Competitorn/a
Meas. Tech.ChEMBL_490893 (CHEMBL989169)
Ki 0.54±n/a nM
Citation Charoenchai, LWang, HWang, JBAldrich, JV High affinity conformationally constrained nociceptin/orphanin FQ(1-13) amide analogues. J Med Chem51:4385-7 (2008) 
 
Nociceptin receptor
Name:Nociceptin receptor
Type:G Protein-Coupled Receptor (GPCR)
Mol. Mass.:40702.87
Organism:Homo sapiens (Human)
Description:P41146
Residue:370
BDBM50262292
NameBDBM50262292
Synonyms:CHEMBL507269 | [Asp6,Lys10]N/OFQ(1-13)NH2
TypeSmall organic molecule
Emp. Form.C66H109N23O16
Mol. Mass.1480.7162
SMILES[#6]-[#6@@H](-[#8])-[#6@H](-[#7]-[#6](=O)-[#6@H](-[#6]-c1ccccc1)-[#7]-[#6](=O)-[#6]-[#7]-[#6](=O)-[#6]-[#7]-[#6](=O)-[#6@@H](-[#7])-[#6]-c1ccccc1)-[#6](=O)-[#7]-[#6@@H](-[#6]-[#6](-[#8])=O)-[#6](=O)-[#7]-[#6@@H](-[#6])-[#6](=O)-[#7]-[#6@@H](-[#6]-[#6]-[#6]\[#7]=[#6](/[#7])-[#7])-[#6](=O)-[#7]-[#6@@H](-[#6]-[#6]-[#6]-[#6]-[#7])-[#6](=O)-[#7]-[#6@@H](-[#6]-[#6]-[#6]-[#6]-[#7])-[#6](=O)-[#7]-[#6@@H](-[#6])-[#6](=O)-[#7]-[#6@@H](-[#6]-[#6]-[#6]\[#7]=[#6](/[#7])-[#7])-[#6](=O)-[#7]-[#6@@H](-[#6]-[#6]-[#6]-[#6]-[#7])-[#6](-[#7])=O