Reaction Details
TargetEctonucleoside triphosphate diphosphohydrolase 2
LigandBDBM50262312
Substrate/Competitorn/a
Meas. Tech.ChEMBL_514292 (CHEMBL979122)
Ki 116000±n/a nM
Citation Brunschweiger, AIqbal, JUmbach, FScheiff, ABMunkonda, MNSévigny, JKnowles, AFMüller, CE Selective nucleoside triphosphate diphosphohydrolase-2 (NTPDase2) inhibitors: nucleotide mimetics derived from uridine-5'-carboxamide. J Med Chem51:4518-28 (2008) 
 
Ectonucleoside triphosphate diphosphohydrolase 2
Name:Ectonucleoside triphosphate diphosphohydrolase 2
Type:PROTEIN
Mol. Mass.:53675.44
Organism:Homo sapiens (Human)
Description:ChEMBL_1453714
Residue:495
BDBM50262312
NameBDBM50262312
Synonyms:2-[2-((2S,3R,4S,5R)-5-(2,4-Dioxo-3,4-dihydropyrimidin-1(2H)-yl)-3,4-dihydroxytetrahydrofurane-2-carboxamido)ethylamido]ethylphosphonic acid diethyl ester | CHEMBL469244
TypeSmall organic molecule
Emp. Form.C17H27N4O10P
Mol. Mass.478.3908
SMILESCCOP(=O)(CCNC(=O)CNC(=O)[C@H]1O[C@H]([C@H](O)[C@@H]1O)n1ccc(=O)[nH]c1=O)OCC