Reaction Details
TargetEctonucleoside triphosphate diphosphohydrolase 2
LigandBDBM50262249
Substrate/Competitorn/a
Meas. Tech.ChEMBL_514542 (CHEMBL968896)
IC50 42000±n/a nM
Citation Brunschweiger, AIqbal, JUmbach, FScheiff, ABMunkonda, MNSévigny, JKnowles, AFMüller, CE Selective nucleoside triphosphate diphosphohydrolase-2 (NTPDase2) inhibitors: nucleotide mimetics derived from uridine-5'-carboxamide. J Med Chem51:4518-28 (2008) 
 
Ectonucleoside triphosphate diphosphohydrolase 2
Name:Ectonucleoside triphosphate diphosphohydrolase 2
Type:PROTEIN
Mol. Mass.:53675.44
Organism:Homo sapiens (Human)
Description:ChEMBL_1453714
Residue:495
BDBM50262249
NameBDBM50262249
Synonyms:4-[2-((2S,3R,4S,5R)-5-(2,4-Dioxo-3,4-dihydropyrimidin-1(2H)-yl)-3,4-dihydroxytetrahydrofurane-2-carboxamido)ethylamido-]benzylphosphonic Acid Diethyl Ester | CHEMBL469212
TypeSmall organic molecule
Emp. Form.C22H29N4O10P
Mol. Mass.540.4602
SMILESCCOP(=O)(Cc1ccc(NC(=O)CNC(=O)[C@H]2O[C@H]([C@H](O)[C@@H]2O)n2ccc(=O)[nH]c2=O)cc1)OCC