Reaction Details
TargetBeta-2 adrenergic receptor
LigandBDBM50272805
Substrate/Competitorn/a
Meas. Tech.ChEMBL_514435 (CHEMBL974622)
EC50>1000±n/a nM
Citation Imanishi, MNakajima, YTomishima, YHamashima, HWashizuka, KSakurai, MMatsui, SImamura, EUeshima, KYamamoto, TYamamoto, NIshikawa, HNakano, KUnami, NHamada, KMatsumura, YTakamura, FHattori, K Discovery of a novel series of benzoic acid derivatives as potent and selective human beta3 adrenergic receptor agonists with good oral bioavailability. 3. Phenylethanolaminotetraline (PEAT) skeleton containing biphenyl or biphenyl ether moiety. J Med Chem51:4804-22 (2008) 
 
Beta-2 adrenergic receptor
Name:Beta-2 adrenergic receptor
Type:n/a
Mol. Mass.:46461.69
Organism:Homo sapiens (Human)
Description:P07550
Residue:413
BDBM50272805
NameBDBM50272805
Synonyms:6-[((7S)-7-{[(2R)-2-(3-Chlorophenyl)-2-hydroxyethyl]amino}-5,6,7,8-tetrahydro-2-naphthalenyl)oxy]nicotinic Acid | CHEMBL498703
TypeSmall organic molecule
Emp. Form.C24H23ClN2O4
Mol. Mass.438.903
SMILESO[C@@H](CN[C@H]1CCc2ccc(Oc3ccc(cn3)C(O)=O)cc2C1)c1cccc(Cl)c1