Reaction Details
TargetCannabinoid receptor 2
LigandBDBM50273185
Substrate/Competitorn/a
Meas. Tech.ChEMBL_509983 (CHEMBL1005576)
EC50 131.1±n/a nM
Citation Diaz, PXu, JAstruc-Diaz, FPan, HMBrown, DLNaguib, M Design and synthesis of a novel series of N-alkyl isatin acylhydrazone derivatives that act as selective cannabinoid receptor 2 agonists for the treatment of neuropathic pain. J Med Chem51:4932-47 (2008) 
 
Cannabinoid receptor 2
Name:Cannabinoid receptor 2
Type:G Protein-Coupled Receptor (GPCR)
Mol. Mass.:39690.94
Organism:Homo sapiens (Human)
Description:P34972
Residue:360
BDBM50273185
NameBDBM50273185
Synonyms:CHEMBL456536 | N-[(3Z)-1-(4-Chlorobenzyl)-2-oxo-1,2-dihydro-3H-indol-3-ylidene]benzohydrazide
TypeSmall organic molecule
Emp. Form.C22H16ClN3O2
Mol. Mass.389.834
SMILESClc1ccc(CN2C(=O)C(=NNC(=O)c3ccccc3)c3ccccc23)cc1