Reaction Details
TargetCannabinoid receptor 1
LigandBDBM50273183
Substrate/Competitorn/a
Meas. Tech.ChEMBL_509980 (CHEMBL1005573)
EC50 62.3±n/a nM
Citation Diaz, PXu, JAstruc-Diaz, FPan, HMBrown, DLNaguib, M Design and synthesis of a novel series of N-alkyl isatin acylhydrazone derivatives that act as selective cannabinoid receptor 2 agonists for the treatment of neuropathic pain. J Med Chem51:4932-47 (2008) 
 
Cannabinoid receptor 1
Name:Cannabinoid receptor 1
Type:G Protein-Coupled Receptor (GPCR)
Mol. Mass.:52868.96
Organism:Homo sapiens (Human)
Description:P21554
Residue:472
BDBM50273183
NameBDBM50273183
Synonyms:CHEMBL514565 | N-[(3Z)-1-(Cyclohexylmethyl)-2-oxo-1,2-dihydro-3H-indol-3-ylidene]benzohydrazide
TypeSmall organic molecule
Emp. Form.C22H23N3O2
Mol. Mass.361.4369
SMILESO=C(NN=C1C(=O)N(CC2CCCCC2)c2ccccc12)c1ccccc1