Reaction Details
TargetCannabinoid receptor 1
LigandBDBM50273135
Substrate/Competitorn/a
Meas. Tech.ChEMBL_509980 (CHEMBL1005573)
EC50 314.1±n/a nM
Citation Diaz, PXu, JAstruc-Diaz, FPan, HMBrown, DLNaguib, M Design and synthesis of a novel series of N-alkyl isatin acylhydrazone derivatives that act as selective cannabinoid receptor 2 agonists for the treatment of neuropathic pain. J Med Chem51:4932-47 (2008) 
 
Cannabinoid receptor 1
Name:Cannabinoid receptor 1
Type:G Protein-Coupled Receptor (GPCR)
Mol. Mass.:52868.96
Organism:Homo sapiens (Human)
Description:P21554
Residue:472
BDBM50273135
NameBDBM50273135
Synonyms:CHEMBL504754 | N-[(3Z)-1-(1-Pentyl)-2-oxo-1,2-dihydro-3H-indol-3-ylidene]benzohydrazide
TypeSmall organic molecule
Emp. Form.C20H21N3O2
Mol. Mass.335.3996
SMILESCCCCCN1C(=O)C(=NNC(=O)c2ccccc2)c2ccccc12