Reaction Details
TargetE3 ubiquitin-protein ligase Mdm2
LigandBDBM50272597
Substrate/Competitorn/a
Meas. Tech.ChEMBL_510408 (CHEMBL1003084)
Kd 8000±n/a nM
Citation Rothweiler, UCzarna, AWeber, LPopowicz, GMBrongel, KKowalska, KOrth, MStemmann, OHolak, TA NMR screening for lead compounds using tryptophan-mutated proteins. J Med Chem51:5035-42 (2008) 
 
E3 ubiquitin-protein ligase Mdm2
Name:E3 ubiquitin-protein ligase Mdm2
Type:Oncoprotein
Mol. Mass.:55196.54
Organism:Homo sapiens (Human)
Description:Q00987
Residue:491
BDBM50272597
NameBDBM50272597
Synonyms:(trans-2-(4-chlorobenzyl)-3-(4-chlorophenyl)-1-oxo-1,2,3,4-tetrahydroisoquinoline-4 carboxylic acid) | CHEMBL497305
TypeSmall organic molecule
Emp. Form.C23H17Cl2NO3
Mol. Mass.426.292
SMILESOC(=O)[C@H]1[C@@H](N(Cc2ccc(Cl)cc2)C(=O)c2ccccc12)c1ccc(Cl)cc1