Reaction Details
TargetTrifunctional purine biosynthetic protein adenosine-3
LigandBDBM50272273
Substrate/Competitorn/a
Meas. Tech.ChEMBL_510466 (CHEMBL1006407)
IC50 2510±n/a nM
Citation Deng, YWang, YCherian, CHou, ZBuck, SAMatherly, LHGangjee, A Synthesis and discovery of high affinity folate receptor-specific glycinamide ribonucleotide formyltransferase inhibitors with antitumor activity. J Med Chem51:5052-63 (2008) 
 
Trifunctional purine biosynthetic protein adenosine-3
Name:Trifunctional purine biosynthetic protein adenosine-3
Type:PROTEIN
Mol. Mass.:107504.27
Organism:Mus musculus
Description:ChEMBL_497843
Residue:1010
BDBM50272273
NameBDBM50272273
Synonyms:CHEMBL526928 | N-{4-[6-(2-Amino-4-oxo-4,7-dihydro-3H-pyrrolo[2,3-d]pyrimidin-6-yl)hexyl]benzoyl}-L-glutamic Acid
TypeSmall organic molecule
Emp. Form.C24H29N5O6
Mol. Mass.483.517
SMILESNc1nc2[nH]c(CCCCCCc3ccc(cc3)C(=O)N[C@@H](CCC(O)=O)C(O)=O)cc2c(=O)[nH]1