Reaction Details
TargetCannabinoid receptor 2
LigandBDBM50272485
Substrate/Competitorn/a
Meas. Tech.ChEMBL_510471 (CHEMBL1006412)
Ki 24.2±n/a nM
Citation Pasquini, SBotta, LSemeraro, TMugnaini, CLigresti, APalazzo, EMaione, SDi Marzo, VCorelli, F Investigations on the 4-quinolone-3-carboxylic acid motif. 2. Synthesis and structure-activity relationship of potent and selective cannabinoid-2 receptor agonists endowed with analgesic activity in vivo. J Med Chem51:5075-84 (2008) 
 
Cannabinoid receptor 2
Name:Cannabinoid receptor 2
Type:G Protein-Coupled Receptor (GPCR)
Mol. Mass.:39690.94
Organism:Homo sapiens (Human)
Description:P34972
Residue:360
BDBM50272485
NameBDBM50272485
Synonyms:(R)-7-Ethoxy-4-oxo-1-pentyl-N-(1-phenylethyl)-1,4-dihydroquinoline-3-carboxamide | CHEMBL497681
TypeSmall organic molecule
Emp. Form.C25H30N2O3
Mol. Mass.406.5173
SMILESCCCCCn1cc(C(=O)N[C@H](C)c2ccccc2)c(=O)c2ccc(OCC)cc12