Reaction Details
TargetCannabinoid receptor 2
LigandBDBM50180040
Substrate/Competitorn/a
Meas. Tech.ChEMBL_510471 (CHEMBL1006412)
Ki 4.7±n/a nM
Citation Pasquini, SBotta, LSemeraro, TMugnaini, CLigresti, APalazzo, EMaione, SDi Marzo, VCorelli, F Investigations on the 4-quinolone-3-carboxylic acid motif. 2. Synthesis and structure-activity relationship of potent and selective cannabinoid-2 receptor agonists endowed with analgesic activity in vivo. J Med Chem51:5075-84 (2008) 
 
Cannabinoid receptor 2
Name:Cannabinoid receptor 2
Type:G Protein-Coupled Receptor (GPCR)
Mol. Mass.:39690.94
Organism:Homo sapiens (Human)
Description:P34972
Residue:360
BDBM50180040
NameBDBM50180040
Synonyms:4-Oxo-1-pentyl-1,4-dihydro-quinoline-3-carboxylic acid adamantan-1-ylamide N3-(1-adamantyl)-4-oxo-1-pentyl-1,4-dihydroquinoline-3-carboxamide
TypeSmall organic molecule
Emp. Form.C25H32N2O2
Mol. Mass.392.5338
SMILESCCCCCn1cc(C(=O)NC23CC4CC(CC(C4)C2)C3)c(=O)c2ccccc12