Reaction Details
TargetCannabinoid receptor 1
LigandBDBM50272341
Substrate/Competitorn/a
Meas. Tech.ChEMBL_510470 (CHEMBL1006411)
Ki>10000±n/a nM
Citation Pasquini, SBotta, LSemeraro, TMugnaini, CLigresti, APalazzo, EMaione, SDi Marzo, VCorelli, F Investigations on the 4-quinolone-3-carboxylic acid motif. 2. Synthesis and structure-activity relationship of potent and selective cannabinoid-2 receptor agonists endowed with analgesic activity in vivo. J Med Chem51:5075-84 (2008) 
 
Cannabinoid receptor 1
Name:Cannabinoid receptor 1
Type:G Protein-Coupled Receptor (GPCR)
Mol. Mass.:52868.96
Organism:Homo sapiens (Human)
Description:P21554
Residue:472
BDBM50272341
NameBDBM50272341
Synonyms:CHEMBL500925 | N-(Adamant-1-yl)-7-chloro-8-methyl-4-oxo-1-pentyl-1,4-dihydroquinoline-3-carboxamide
TypeSmall organic molecule
Emp. Form.C26H33ClN2O2
Mol. Mass.441.005
SMILESCCCCCn1cc(C(=O)NC23CC4CC(CC(C4)C2)C3)c(=O)c2ccc(Cl)c(C)c12