Reaction Details
TargetCannabinoid receptor 1
LigandBDBM50272426
Substrate/Competitorn/a
Meas. Tech.ChEMBL_510470 (CHEMBL1006411)
Ki>10000±n/a nM
Citation Pasquini, SBotta, LSemeraro, TMugnaini, CLigresti, APalazzo, EMaione, SDi Marzo, VCorelli, F Investigations on the 4-quinolone-3-carboxylic acid motif. 2. Synthesis and structure-activity relationship of potent and selective cannabinoid-2 receptor agonists endowed with analgesic activity in vivo. J Med Chem51:5075-84 (2008) 
 
Cannabinoid receptor 1
Name:Cannabinoid receptor 1
Type:G Protein-Coupled Receptor (GPCR)
Mol. Mass.:52868.96
Organism:Homo sapiens (Human)
Description:P21554
Residue:472
BDBM50272426
NameBDBM50272426
Synonyms:CHEMBL498132 | N-(Adamant-1-yl)-1-allyl-5,8-dimethoxy-4-oxo-1,4-dihydroquinoline-3-carboxamide
TypeSmall organic molecule
Emp. Form.C25H30N2O4
Mol. Mass.422.5167
SMILESCOc1ccc(OC)c2c1n(CC=C)cc(C(=O)NC13CC4CC(CC(C4)C1)C3)c2=O