Reaction Details
TargetCone cGMP-specific 3',5'-cyclic phosphodiesterase subunit alpha'
LigandBDBM14390
Substrate/Competitorn/a
Meas. Tech.ChEMBL_510819 (CHEMBL998838)
IC50 160±n/a nM
Citation Dell'Agli, MGalli, GVDal Cero, EBelluti, FMatera, RZironi, EPagliuca, GBosisio, E Potent inhibition of human phosphodiesterase-5 by icariin derivatives. J Nat Prod71:1513-7 (2008) 
 
Cone cGMP-specific 3',5'-cyclic phosphodiesterase subunit alpha'
Name:Cone cGMP-specific 3',5'-cyclic phosphodiesterase subunit alpha'
Type:Protein
Mol. Mass.:99132.02
Organism:Homo sapiens (Human)
Description:P51160
Residue:858
BDBM14390
NameBDBM14390
Synonyms:5-[2-ethoxy-5-(4-methyl-1-piperazinylsulfonyl)phenyl]-1-methyl-3-n-propyl-1,6-dihydro-7H-pyrazolo[4,3-d]pyrimidin-7-one CHEMBL192 Sildenafil US11155558, Compound sildenafil US11897890, Compound sildenafil | Viagra
TypeSmall organic molecule
Emp. Form.C22H30N6O4S
Mol. Mass.474.576
SMILESCCCc1nn(C)c2c1nc([nH]c2=O)-c1cc(ccc1OCC)S(=O)(=O)N1CCN(C)CC1