Reaction Details
TargetFatty acid-binding protein, intestinal
LigandBDBM28701
Substrate/Competitorn/a
Meas. Tech.ChEMBL_555397 (CHEMBL964794)
Ki 33000±n/a nM
Citation Chuang, SVelkov, THorne, JPorter, CJScanlon, MJ Characterization of the drug binding specificity of rat liver fatty acid binding protein. J Med Chem51:3755-64 (2008) 
 
Fatty acid-binding protein, intestinal
Name:Fatty acid-binding protein, intestinal
Type:Protein
Mol. Mass.:15207.56
Organism:Homo sapiens (Human)
Description:n/a
Residue:132
BDBM28701
NameBDBM28701
Synonyms:2-(4-{2-[(4-chlorophenyl)formamido]ethyl}phenoxy)-2-methylpropanoic acid Bezafibrate Cedur | Sklerofibrat
TypeSmall organic molecule
Emp. Form.C19H20ClNO4
Mol. Mass.361.819
SMILESCC(C)(Oc1ccc(CCNC(=O)c2ccc(Cl)cc2)cc1)C(O)=O