Reaction Details
TargetFatty acid-binding protein, liver
LigandBDBM28701
Substrate/Competitorn/a
Meas. Tech.ChEMBL_555398 (CHEMBL964795)
Ki 44400±n/a nM
Citation Chuang, SVelkov, THorne, JPorter, CJScanlon, MJ Characterization of the drug binding specificity of rat liver fatty acid binding protein. J Med Chem51:3755-64 (2008) 
 
Fatty acid-binding protein, liver
Name:Fatty acid-binding protein, liver
Type:Protein
Mol. Mass.:14274.39
Organism:Rattus norvegicus (Rat)
Description:rat L-FABP
Residue:127
BDBM28701
NameBDBM28701
Synonyms:2-(4-{2-[(4-chlorophenyl)formamido]ethyl}phenoxy)-2-methylpropanoic acid Bezafibrate Cedur | Sklerofibrat
TypeSmall organic molecule
Emp. Form.C19H20ClNO4
Mol. Mass.361.819
SMILESCC(C)(Oc1ccc(CCNC(=O)c2ccc(Cl)cc2)cc1)C(O)=O