Reaction Details
TargetFatty acid-binding protein, liver
LigandBDBM18207
Substrate/Competitorn/a
Meas. Tech.ChEMBL_555398 (CHEMBL964795)
Ki 41300±n/a nM
Citation Chuang, SVelkov, THorne, JPorter, CJScanlon, MJ Characterization of the drug binding specificity of rat liver fatty acid binding protein. J Med Chem51:3755-64 (2008) 
 
Fatty acid-binding protein, liver
Name:Fatty acid-binding protein, liver
Type:Protein
Mol. Mass.:14274.39
Organism:Rattus norvegicus (Rat)
Description:rat L-FABP
Residue:127
BDBM18207
NameBDBM18207
Synonyms:(1R,2S,10S,11S,13R,14R,15S,17S)-1-fluoro-14,17-dihydroxy-14-(2-hydroxyacetyl)-2,13,15-trimethyltetracyclo[8.7.0.0^{2,7}.0^{11,15}]heptadeca-3,6-dien-5-one US11554172, Compound Dexamethasone dexamethasone (tetramethyl-rhodamine conjugated )
TypeSteroid
Emp. Form.C22H29FO5
Mol. Mass.392.4611
SMILES[H][C@@]12C[C@@H](C)[C@](O)(C(=O)CO)[C@@]1(C)C[C@H](O)[C@@]1(F)[C@@]2([H])CCC2=CC(=O)C=C[C@]12C