Reaction Details
TargetThrombopoietin receptor
LigandBDBM50248106
Substrate/Competitorn/a
Meas. Tech.ChEMBL_535587 (CHEMBL987061)
EC50 38±n/a nM
Citation Alper, PBMarsilje, THMutnick, DLu, WChatterjee, ARoberts, MJHe, YKaranewsky, DSChow, DLao, JGerken, ATuntland, TLiu, BChang, JGordon, PSeidel, HMTian, SS Discovery and biological evaluation of benzo[a]carbazole-based small molecule agonists of the thrombopoietin (Tpo) receptor. Bioorg Med Chem Lett18:5255-8 (2008) 
 
Thrombopoietin receptor
Name:Thrombopoietin receptor
Type:PROTEIN
Mol. Mass.:71243.48
Organism:Homo sapiens (Human)
Description:ChEMBL_535587
Residue:635
BDBM50248106
NameBDBM50248106
Synonyms:CHEMBL461101 Eltrombopag olamine
TypeSmall organic molecule
Emp. Form.C25H22N4O4
Mol. Mass.442.4666
SMILESCc1[nH]n(-c2ccc(C)c(C)c2)c(=O)c1N=Nc1cccc(-c2cccc(c2)C(O)=O)c1O